Opened 11 years ago

Closed 11 years ago

Last modified 11 years ago

#1565 closed enhancement (fixed)

Ubuntu 9.10 support for sugar-jhbuild

Reported by: HoboPrimate Owned by: sascha_silbe
Priority: Unspecified by Maintainer Milestone: Unspecified
Component: sugar-jhbuild Version: Git as of bugdate
Severity: Unspecified Keywords:
Cc: Distribution/OS: Ubuntu
Bug Status: Resolved

Description

The error message is as follows:

gcc -DHAVE_CONFIG_H -I. -I. -I.. -I.. -I.. -D_REENTRANT -I/home/jobezone/sugar-jhbuild/install/include/dbus-1.0 -I/usr/include/glib-2.0 -I/usr/lib/glib-2.0/include -I/usr/include/dbus-1.0 -I/usr/lib/dbus-1.0/include -I/usr/include/gtk-2.0 -I/usr/lib/gtk-2.0/include -I/usr/include/atk-1.0 -I/usr/include/cairo -I/usr/include/pango-1.0 -I/usr/include/pixman-1 -I/usr/include/freetype2 -I/usr/include/directfb -I/usr/include/libpng12 -I/usr/include/libxml2 -DG_LOG_DOMAIN=\"GConf\" -DPREFIX=\"/home/jobezone/sugar-jhbuild/install\" -DGCONF_LOCALE_DIR=\"/home/jobezone/sugar-jhbuild/install/share/locale\" -DGCONF_SRCDIR=\"/home/jobezone/sugar-jhbuild/source/GConf-dbus-2.16.0\" -DGCONF_CONFDIR=\"/home/jobezone/sugar-jhbuild/install/etc/gconf/2\" -DGCONF_ETCDIR=\"/home/jobezone/sugar-jhbuild/install/etc/gconf\" -DGCONF_BINDIR=\"/home/jobezone/sugar-jhbuild/install/bin\" -DGCONF_SERVERDIR=\"/home/jobezone/sugar-jhbuild/install/libexec\" -DGCONF_BUILDDIR=\"..\" -DGCONF_BACKEND_DIR=\"/home/jobezone/sugar-jhbuild/install/lib/GConf-dbus/2\" -DVERSION=\"2.16.0\" -DGCONF_ENABLE_INTERNALS=1 -DGCONFD=\"gconfd-2\" -DDBUS_API_SUBJECT_TO_CHANGE=\"1\" -g -O2 -Wall -MT gconf.lo -MD -MP -MF .deps/gconf.Tpo -c gconf.c -fPIC -DPIC -o .libs/gconf.o
gconf.c:20:18: error: popt.h: No such file or directory
gconf.c:2551: error: array type has incomplete element type
make[3]: * [gconf.lo] Error 1
make[3]: Leaving directory `/home/jobezone/sugar-jhbuild/source/GConf-dbus-2.16.0/gconf'
make[2]:
* [all] Error 2
make[2]: Leaving directory `/home/jobezone/sugar-jhbuild/source/GConf-dbus-2.16.0/gconf'
make[1]: * [all-recursive] Error 1
make[1]: Leaving directory `/home/jobezone/sugar-jhbuild/source/GConf-dbus-2.16.0'
make:
* [all] Error 2
* Error during phase build of GConf-dbus: ########## Error running make * [6/41]

I'm running Ubuntu 9.10

Change History (10)

comment:1 Changed 11 years ago by HoboPrimate

And it errs in building Abiword as well. I notice that both error messages, the above and this one contain this piece of text:

"ap_Args.h:25:18: error: popt.h: Ficheiro ou directoria inexistente [Non-existent file or directory]"

Anyway, here is the full Abiword error:

g++ -DPACKAGE_NAME=\"abiword\" -DPACKAGE_TARNAME=\"abiword\" -DPACKAGE_VERSION=\"2.6.8\" -DPACKAGE_STRING=\"abiword\ 2.6.8\" -DPACKAGE_BUGREPORT=\"http://www.abisource.com/\" -DPACKAGE=\"abiword\" -DVERSION=\"2.6.8\" -DABIWORD_SERIES=\"2.6\" -DSTDC_HEADERS=1 -DHAVE_SYS_TYPES_H=1 -DHAVE_SYS_STAT_H=1 -DHAVE_STDLIB_H=1 -DHAVE_STRING_H=1 -DHAVE_MEMORY_H=1 -DHAVE_STRINGS_H=1 -DHAVE_INTTYPES_H=1 -DHAVE_STDINT_H=1 -DHAVE_UNISTD_H=1 -DSIZEOF_LONG_INT=4 -DEMBEDDED_TARGET_GENERIC=1 -DEMBEDDED_TARGET_HILDON=2 -DEMBEDDED_TARGET_POKY=3 -DENABLE_STATUSBAR=1 -DHAVE_PANGOFT2=1 -DWITH_ENCHANT=1 -DSTDC_HEADERS=1 -DHAVE_LIMITS_H=1 -DHAVE_STRINGS_H=1 -DHAVE_SYS_TIME_H=1 -DHAVE_UNISTD_H=1 -DHAVE_MALLOC_H=1 -DCHECKED_ENDIANNESS=1 -DHAVE_LIBXML2=1 -DHAVE_WV=1 -DHAVE_ALLOCA_H=1 -DHAVE_ALLOCA=1 -DRETSIGTYPE=void -DABI_SCANDIR_SELECT_QUALIFIER=const -I. -I'../../../../src/af/util/xp' -I'../../../../src/af/tf/xp' -I'../../../../src/af/ev/xp' -I'../../../../src/af/ev/xp' -I'../../../../src/af/gr/xp' -I'../../../../src/af/xap/xp' -I'../../../../src/af/util/unix' -I'../../../../src/af/ev/unix' -I'../../../../src/af/gr/unix' -I'../../../../src/af/xap/unix' -I'../../../../src/wp/ap/xp' -I'../../../../src/wp/impexp/xp' -I'../../../../src/wp/ap/unix' -I'../../../../src/wp/ap/xp/ToolbarIcons' -I'../../../../src/pkg/linux/apkg' -I'../../../../src/text/ptbl/xp' -I'../../../../src/text/fmt/xp' -I'../../../../src/text/fmt/unix' -I'../../../../src/other/spell/xp' -fPIC -Wall -pedantic -D_POSIX_SOURCE -D_BSD_SOURCE -pipe -DDEBUG -DUT_DEBUG -DFMT_TEST -DUT_TEST -DPT_TEST -g -I/usr/include/libxml2 -I/usr/include/fribidi -I/usr/include/wv -I/usr/include/libgsf-1 -I/usr/include/glib-2.0 -I/usr/lib/glib-2.0/include -I/usr/include/libxml2 -I/usr/include/freetype2 -I/usr/include/freetype2 -I/usr/include/libpng12 -DHAVE_THREADS=1 -pthread -I/usr/include/glib-2.0 -I/usr/lib/glib-2.0/include -DABISIZEOF_LONG_INT=4 -I/usr/include/libgsf-1 -I/usr/include/glib-2.0 -I/usr/lib/glib-2.0/include -I/usr/include/libxml2 -DWITH_GSF_INPUT_HTTP=1 -I../../../../goffice-bits -I/usr/include/enchant -I/usr/include/glib-2.0 -I/usr/lib/glib-2.0/include -DENABLE_SPELL -DPACKAGE_NAME=\"abiword\" -DPACKAGE_TARNAME=\"abiword\" -DPACKAGE_VERSION=\"2.6.8\" -DPACKAGE_STRING=\"abiword\ 2.6.8\" -DPACKAGE_BUGREPORT=\"http://www.abisource.com/\" -DPACKAGE=\"abiword\" -DVERSION=\"2.6.8\" -DABIWORD_SERIES=\"2.6\" -DSTDC_HEADERS=1 -DHAVE_SYS_TYPES_H=1 -DHAVE_SYS_STAT_H=1 -DHAVE_STDLIB_H=1 -DHAVE_STRING_H=1 -DHAVE_MEMORY_H=1 -DHAVE_STRINGS_H=1 -DHAVE_INTTYPES_H=1 -DHAVE_STDINT_H=1 -DHAVE_UNISTD_H=1 -DSIZEOF_LONG_INT=4 -DEMBEDDED_TARGET_GENERIC=1 -DEMBEDDED_TARGET_HILDON=2 -DEMBEDDED_TARGET_POKY=3 -DENABLE_STATUSBAR=1 -DHAVE_PANGOFT2=1 -DWITH_ENCHANT=1 -DSTDC_HEADERS=1 -DHAVE_LIMITS_H=1 -DHAVE_STRINGS_H=1 -DHAVE_SYS_TIME_H=1 -DHAVE_UNISTD_H=1 -DHAVE_MALLOC_H=1 -DCHECKED_ENDIANNESS=1 -DHAVE_LIBXML2=1 -DHAVE_WV=1 -DHAVE_ALLOCA_H=1 -DHAVE_ALLOCA=1 -DRETSIGTYPE=void -DABI_SCANDIR_SELECT_QUALIFIER=const -D_REENTRANT -I/usr/include/gtk-2.0 -I/usr/lib/gtk-2.0/include -I/usr/include/atk-1.0 -I/usr/include/cairo -I/usr/include/pango-1.0 -I/usr/include/pixman-1 -I/usr/include/freetype2 -I/usr/include/directfb -I/usr/include/libpng12 -I/usr/include/glib-2.0 -I/usr/lib/glib-2.0/include -I/usr/include/libglade-2.0 -I/usr/include/libxml2 -I/usr/include/pango-1.0 -I/usr/include/freetype2 -I/usr/include/glib-2.0 -I/usr/lib/glib-2.0/include -I/usr/include/glib-2.0 -I/usr/lib/glib-2.0/include -I/usr/include/freetype2 -I../../../../goffice-bits -DSUPPORTS_UT_IDLE=1 -DABI_BUILD_VERSION=\"2.6.8\" -MT ap_Dialog_Spell.o -MD -MP -MF .deps/ap_Dialog_Spell.Tpo -c -o ap_Dialog_Spell.o ap_Dialog_Spell.cpp
mv -f .deps/ap_Dialog_Spell.Tpo .deps/ap_Dialog_Spell.Po
g++ -DPACKAGE_NAME=\"abiword\" -DPACKAGE_TARNAME=\"abiword\" -DPACKAGE_VERSION=\"2.6.8\" -DPACKAGE_STRING=\"abiword\ 2.6.8\" -DPACKAGE_BUGREPORT=\"http://www.abisource.com/\" -DPACKAGE=\"abiword\" -DVERSION=\"2.6.8\" -DABIWORD_SERIES=\"2.6\" -DSTDC_HEADERS=1 -DHAVE_SYS_TYPES_H=1 -DHAVE_SYS_STAT_H=1 -DHAVE_STDLIB_H=1 -DHAVE_STRING_H=1 -DHAVE_MEMORY_H=1 -DHAVE_STRINGS_H=1 -DHAVE_INTTYPES_H=1 -DHAVE_STDINT_H=1 -DHAVE_UNISTD_H=1 -DSIZEOF_LONG_INT=4 -DEMBEDDED_TARGET_GENERIC=1 -DEMBEDDED_TARGET_HILDON=2 -DEMBEDDED_TARGET_POKY=3 -DENABLE_STATUSBAR=1 -DHAVE_PANGOFT2=1 -DWITH_ENCHANT=1 -DSTDC_HEADERS=1 -DHAVE_LIMITS_H=1 -DHAVE_STRINGS_H=1 -DHAVE_SYS_TIME_H=1 -DHAVE_UNISTD_H=1 -DHAVE_MALLOC_H=1 -DCHECKED_ENDIANNESS=1 -DHAVE_LIBXML2=1 -DHAVE_WV=1 -DHAVE_ALLOCA_H=1 -DHAVE_ALLOCA=1 -DRETSIGTYPE=void -DABI_SCANDIR_SELECT_QUALIFIER=const -I. -I'../../../../src/af/util/xp' -I'../../../../src/af/tf/xp' -I'../../../../src/af/ev/xp' -I'../../../../src/af/ev/xp' -I'../../../../src/af/gr/xp' -I'../../../../src/af/xap/xp' -I'../../../../src/af/util/unix' -I'../../../../src/af/ev/unix' -I'../../../../src/af/gr/unix' -I'../../../../src/af/xap/unix' -I'../../../../src/wp/ap/xp' -I'../../../../src/wp/impexp/xp' -I'../../../../src/wp/ap/unix' -I'../../../../src/wp/ap/xp/ToolbarIcons' -I'../../../../src/pkg/linux/apkg' -I'../../../../src/text/ptbl/xp' -I'../../../../src/text/fmt/xp' -I'../../../../src/text/fmt/unix' -I'../../../../src/other/spell/xp' -fPIC -Wall -pedantic -D_POSIX_SOURCE -D_BSD_SOURCE -pipe -DDEBUG -DUT_DEBUG -DFMT_TEST -DUT_TEST -DPT_TEST -g -I/usr/include/libxml2 -I/usr/include/fribidi -I/usr/include/wv -I/usr/include/libgsf-1 -I/usr/include/glib-2.0 -I/usr/lib/glib-2.0/include -I/usr/include/libxml2 -I/usr/include/freetype2 -I/usr/include/freetype2 -I/usr/include/libpng12 -DHAVE_THREADS=1 -pthread -I/usr/include/glib-2.0 -I/usr/lib/glib-2.0/include -DABISIZEOF_LONG_INT=4 -I/usr/include/libgsf-1 -I/usr/include/glib-2.0 -I/usr/lib/glib-2.0/include -I/usr/include/libxml2 -DWITH_GSF_INPUT_HTTP=1 -I../../../../goffice-bits -I/usr/include/enchant -I/usr/include/glib-2.0 -I/usr/lib/glib-2.0/include -DENABLE_SPELL -DPACKAGE_NAME=\"abiword\" -DPACKAGE_TARNAME=\"abiword\" -DPACKAGE_VERSION=\"2.6.8\" -DPACKAGE_STRING=\"abiword\ 2.6.8\" -DPACKAGE_BUGREPORT=\"http://www.abisource.com/\" -DPACKAGE=\"abiword\" -DVERSION=\"2.6.8\" -DABIWORD_SERIES=\"2.6\" -DSTDC_HEADERS=1 -DHAVE_SYS_TYPES_H=1 -DHAVE_SYS_STAT_H=1 -DHAVE_STDLIB_H=1 -DHAVE_STRING_H=1 -DHAVE_MEMORY_H=1 -DHAVE_STRINGS_H=1 -DHAVE_INTTYPES_H=1 -DHAVE_STDINT_H=1 -DHAVE_UNISTD_H=1 -DSIZEOF_LONG_INT=4 -DEMBEDDED_TARGET_GENERIC=1 -DEMBEDDED_TARGET_HILDON=2 -DEMBEDDED_TARGET_POKY=3 -DENABLE_STATUSBAR=1 -DHAVE_PANGOFT2=1 -DWITH_ENCHANT=1 -DSTDC_HEADERS=1 -DHAVE_LIMITS_H=1 -DHAVE_STRINGS_H=1 -DHAVE_SYS_TIME_H=1 -DHAVE_UNISTD_H=1 -DHAVE_MALLOC_H=1 -DCHECKED_ENDIANNESS=1 -DHAVE_LIBXML2=1 -DHAVE_WV=1 -DHAVE_ALLOCA_H=1 -DHAVE_ALLOCA=1 -DRETSIGTYPE=void -DABI_SCANDIR_SELECT_QUALIFIER=const -D_REENTRANT -I/usr/include/gtk-2.0 -I/usr/lib/gtk-2.0/include -I/usr/include/atk-1.0 -I/usr/include/cairo -I/usr/include/pango-1.0 -I/usr/include/pixman-1 -I/usr/include/freetype2 -I/usr/include/directfb -I/usr/include/libpng12 -I/usr/include/glib-2.0 -I/usr/lib/glib-2.0/include -I/usr/include/libglade-2.0 -I/usr/include/libxml2 -I/usr/include/pango-1.0 -I/usr/include/freetype2 -I/usr/include/glib-2.0 -I/usr/lib/glib-2.0/include -I/usr/include/glib-2.0 -I/usr/lib/glib-2.0/include -I/usr/include/freetype2 -I../../../../goffice-bits -DSUPPORTS_UT_IDLE=1 -DABI_BUILD_VERSION=\"2.6.8\" -MT ap_Args.o -MD -MP -MF .deps/ap_Args.Tpo -c -o ap_Args.o ap_Args.cpp
In file included from ap_Args.cpp:24:
ap_Args.h:25:18: error: popt.h: Ficheiro ou directoria inexistente
In file included from ap_Args.cpp:24:
ap_Args.h:39: error: ‘poptContext’ does not name a type
ap_Args.cpp: In constructor ‘AP_Args::AP_Args(XAP_Args*, const char*, AP_App*)’:
ap_Args.cpp:70: error: class ‘AP_Args’ does not have any field named ‘poptcon’
ap_Args.cpp: In destructor ‘AP_Args::~AP_Args()’:
ap_Args.cpp:77: error: ‘poptcon’ was not declared in this scope
ap_Args.cpp:78: error: ‘poptFreeContext’ was not declared in this scope
ap_Args.cpp: In member function ‘void AP_Args::parsePoptOpts()’:
ap_Args.cpp:93: error: ‘poptcon’ was not declared in this scope
ap_Args.cpp:95: error: ‘poptGetContext’ was not declared in this scope
ap_Args.cpp:97: error: ‘poptGetNextOpt’ was not declared in this scope
ap_Args.cpp:98: error: ‘POPT_ERROR_BADOPT’ was not declared in this scope
ap_Args.cpp:118: error: ‘poptPrintHelp’ was not declared in this scope
ap_Args.cpp: In member function ‘bool AP_Args::doWindowlessArgs(bool&)’:
ap_Args.cpp:164: error: ‘poptcon’ was not declared in this scope
ap_Args.cpp:164: error: ‘poptGetArg’ was not declared in this scope
ap_Args.cpp: At global scope:
ap_Args.cpp:188: error: ‘POPT_ARG_STRING’ was not declared in this scope
ap_Args.cpp:193: error: ‘POPT_ARG_NONE’ was not declared in this scope
ap_Args.cpp:195: error: ‘POPT_ARG_STRING’ was not declared in this scope
ap_Args.cpp:196: error: ‘POPT_ARG_INT’ was not declared in this scope
ap_Args.cpp:197: error: ‘POPT_ARG_STRING’ was not declared in this scope
ap_Args.cpp:198: error: ‘POPT_ARG_STRING’ was not declared in this scope
ap_Args.cpp:199: error: ‘POPT_ARG_STRING’ was not declared in this scope
ap_Args.cpp:200: error: ‘POPT_ARG_STRING’ was not declared in this scope
ap_Args.cpp:201: error: ‘POPT_ARG_STRING’ was not declared in this scope
ap_Args.cpp:202: error: ‘POPT_ARG_INT’ was not declared in this scope
ap_Args.cpp:203: error: ‘POPT_ARG_STRING’ was not declared in this scope
ap_Args.cpp:204: error: ‘POPT_ARG_STRING’ was not declared in this scope
ap_Args.cpp:205: error: ‘POPT_ARG_STRING’ was not declared in this scope
ap_Args.cpp:207: error: ‘POPT_ARG_NONE’ was not declared in this scope
ap_Args.cpp:208: error: ‘POPT_ARG_NONE’ was not declared in this scope
ap_Args.cpp:209: error: ‘POPT_ARG_STRING’ was not declared in this scope
ap_Args.cpp:211: error: elements of array ‘const poptOption AP_Args::const_opts []’ have incomplete type
ap_Args.cpp:211: error: storage size of ‘AP_Args::const_opts’ isn't known
make[4]: * [ap_Args.o] Error 1
make[4]: Leaving directory `/home/jobezone/sugar-jhbuild/source/abiword-2.6.8/src/wp/ap/xp'
make[3]:
* [all-recursive] Error 1
make[3]: Leaving directory `/home/jobezone/sugar-jhbuild/source/abiword-2.6.8/src/wp/ap'
make[2]: * [all-recursive] Error 1
make[2]: Leaving directory `/home/jobezone/sugar-jhbuild/source/abiword-2.6.8/src/wp'
make[1]:
* [all-recursive] Error 1
make[1]: Leaving directory `/home/jobezone/sugar-jhbuild/source/abiword-2.6.8/src'
make: * [all-recursive] Error 1
* Error during phase build of abiword: ########## Error running make * [22/41]

comment:2 Changed 11 years ago by HoboPrimate

hulahop also fails.

make[1]: Entering directory `/home/jobezone/sugar-jhbuild/source/hulahop/src'
/bin/bash ../libtool --tag=CXX --mode=compile g++ -DPACKAGE_NAME=\"hulahop\" -DPACKAGE_TARNAME=\"hulahop\" -DPACKAGE_VERSION=\"0.6.0\" -DPACKAGE_STRING=\"hulahop\ 0.6.0\" -DPACKAGE_BUGREPORT=\"\" -DPACKAGE=\"hulahop\" -DVERSION=\"0.6.0\" -DSTDC_HEADERS=1 -DHAVE_SYS_TYPES_H=1 -DHAVE_SYS_STAT_H=1 -DHAVE_STDLIB_H=1 -DHAVE_STRING_H=1 -DHAVE_MEMORY_H=1 -DHAVE_STRINGS_H=1 -DHAVE_INTTYPES_H=1 -DHAVE_STDINT_H=1 -DHAVE_UNISTD_H=1 -DHAVE_DLFCN_H=1 -DLT_OBJDIR=\".libs/\" -I. -D_REENTRANT -I/usr/include/gtk-2.0 -I/usr/lib/gtk-2.0/include -I/usr/include/atk-1.0 -I/usr/include/cairo -I/usr/include/pango-1.0 -I/usr/include/pixman-1 -I/usr/include/freetype2 -I/usr/include/directfb -I/usr/include/libpng12 -I/usr/include/glib-2.0 -I/usr/lib/glib-2.0/include -I/usr/include/python2.6 -fshort-wchar -I/usr/include/xulrunner-1.9.0.14/unstable -I/usr/include/nspr -DPLUGIN_PATH=\"/home/jobezone/sugar-jhbuild/install/lib/mozilla/plugins\" -DLIBXUL_DIR=\"/usr/lib/xulrunner-1.9.0.14\" -DDATA_DIR=\"/home/jobezone/sugar-jhbuild/install/share/hulahop\" -DLIB_DIR=\"/home/jobezone/sugar-jhbuild/install/lib/hulahop\" -g -O2 -MT HulahopDirectoryProvider.lo -MD -MP -MF .deps/HulahopDirectoryProvider.Tpo -c -o HulahopDirectoryProvider.lo HulahopDirectoryProvider.cpp
libtool: compile: g++ -DPACKAGE_NAME=\"hulahop\" -DPACKAGE_TARNAME=\"hulahop\" -DPACKAGE_VERSION=\"0.6.0\" "-DPACKAGE_STRING=\"hulahop 0.6.0\"" -DPACKAGE_BUGREPORT=\"\" -DPACKAGE=\"hulahop\" -DVERSION=\"0.6.0\" -DSTDC_HEADERS=1 -DHAVE_SYS_TYPES_H=1 -DHAVE_SYS_STAT_H=1 -DHAVE_STDLIB_H=1 -DHAVE_STRING_H=1 -DHAVE_MEMORY_H=1 -DHAVE_STRINGS_H=1 -DHAVE_INTTYPES_H=1 -DHAVE_STDINT_H=1 -DHAVE_UNISTD_H=1 -DHAVE_DLFCN_H=1 -DLT_OBJDIR=\".libs/\" -I. -D_REENTRANT -I/usr/include/gtk-2.0 -I/usr/lib/gtk-2.0/include -I/usr/include/atk-1.0 -I/usr/include/cairo -I/usr/include/pango-1.0 -I/usr/include/pixman-1 -I/usr/include/freetype2 -I/usr/include/directfb -I/usr/include/libpng12 -I/usr/include/glib-2.0 -I/usr/lib/glib-2.0/include -I/usr/include/python2.6 -fshort-wchar -I/usr/include/xulrunner-1.9.0.14/unstable -I/usr/include/nspr -DPLUGIN_PATH=\"/home/jobezone/sugar-jhbuild/install/lib/mozilla/plugins\" -DLIBXUL_DIR=\"/usr/lib/xulrunner-1.9.0.14\" -DDATA_DIR=\"/home/jobezone/sugar-jhbuild/install/share/hulahop\" -DLIB_DIR=\"/home/jobezone/sugar-jhbuild/install/lib/hulahop\" -g -O2 -MT HulahopDirectoryProvider.lo -MD -MP -MF .deps/HulahopDirectoryProvider.Tpo -c HulahopDirectoryProvider.cpp -fPIC -DPIC -o .libs/HulahopDirectoryProvider.o
HulahopDirectoryProvider.cpp:20:26: error: nsILocalFile.h: Ficheiro ou directoria inexistente
HulahopDirectoryProvider.cpp:21:39: error: nsAppDirectoryServiceDefs.h: Ficheiro ou directoria inexistente
HulahopDirectoryProvider.cpp:22:36: error: nsDirectoryServiceDefs.h: Ficheiro ou directoria inexistente
HulahopDirectoryProvider.cpp:23:31: error: nsArrayEnumerator.h: Ficheiro ou directoria inexistente
HulahopDirectoryProvider.cpp:24:38: error: nsIToolkitChromeRegistry.h: Ficheiro ou directoria inexistente
HulahopDirectoryProvider.cpp:25:23: error: nsNetUtil.h: Ficheiro ou directoria inexistente
HulahopDirectoryProvider.cpp:26:30: error: nsISupportsArray.h: Ficheiro ou directoria inexistente
HulahopDirectoryProvider.cpp:27:29: error: nsIMutableArray.h: Ficheiro ou directoria inexistente
HulahopDirectoryProvider.cpp:28:25: error: nsXULAppAPI.h: Ficheiro ou directoria inexistente
In file included from HulahopDirectoryProvider.cpp:30:
HulahopDirectoryProvider.h:20:22: error: nsCOMPtr.h: Ficheiro ou directoria inexistente
HulahopDirectoryProvider.h:21:24: error: nsCOMArray.h: Ficheiro ou directoria inexistente
HulahopDirectoryProvider.h:22:33: error: nsIDirectoryService.h: Ficheiro ou directoria inexistente
In file included from HulahopDirectoryProvider.cpp:30:
HulahopDirectoryProvider.h:25: error: expected class-name before ‘{’ token
HulahopDirectoryProvider.h:28: error: ‘NS_DECL_ISUPPORTS_INHERITED’ does not name a type
HulahopDirectoryProvider.h:37: error: ISO C++ forbids declaration of ‘nsCOMPtr’ with no type
HulahopDirectoryProvider.h:37: error: expected ‘;’ before ‘<’ token
HulahopDirectoryProvider.h:38: error: ISO C++ forbids declaration of ‘nsCOMArray’ with no type
HulahopDirectoryProvider.h:38: error: expected ‘;’ before ‘<’ token
HulahopDirectoryProvider.cpp:33: error: ‘nsIDirectoryServiceProvider’ has not been declared
HulahopDirectoryProvider.cpp:34: error: ‘nsIDirectoryServiceProvider2’ has not been declared
HulahopDirectoryProvider.cpp:36: error: expected constructor, destructor, or type conversion before ‘NS_IMETHODIMP_’
HulahopDirectoryProvider.cpp:42: error: expected constructor, destructor, or type conversion before ‘(’ token
HulahopDirectoryProvider.cpp:48: error: ‘NS_IMETHODIMP’ does not name a type
HulahopDirectoryProvider.cpp:132: error: ‘NS_IMETHODIMP’ does not name a type
HulahopDirectoryProvider.cpp:166: error: no ‘void HulahopDirectoryProvider::SetProfilePath(const char*)’ member function declared in class ‘HulahopDirectoryProvider’
HulahopDirectoryProvider.cpp: In member function ‘void HulahopDirectoryProvider::AddComponentsPath(const char*)’:
HulahopDirectoryProvider.cpp:175: error: ‘nsresult’ was not declared in this scope
HulahopDirectoryProvider.cpp:175: error: expected ‘;’ before ‘rv’
HulahopDirectoryProvider.cpp:177: error: ‘nsCOMPtr’ was not declared in this scope
HulahopDirectoryProvider.cpp:177: error: ‘nsILocalFile’ was not declared in this scope
HulahopDirectoryProvider.cpp:177: error: ‘localFile’ was not declared in this scope
HulahopDirectoryProvider.cpp:178: error: ‘rv’ was not declared in this scope
HulahopDirectoryProvider.cpp:178: error: ‘nsCString’ was not declared in this scope
HulahopDirectoryProvider.cpp:179: error: ‘PR_TRUE’ was not declared in this scope
HulahopDirectoryProvider.cpp:179: error: ‘getter_AddRefs’ was not declared in this scope
HulahopDirectoryProvider.cpp:179: error: ‘NS_NewNativeLocalFile’ was not declared in this scope
HulahopDirectoryProvider.cpp:181: error: ‘mComponentsDirs’ was not declared in this scope
make[1]: * [HulahopDirectoryProvider.lo] Error 1
make[1]: Leaving directory `/home/jobezone/sugar-jhbuild/source/hulahop/src'
make:
* [all-recursive] Error 1
* Error during phase build of hulahop: ########## Error running make * [26/41]

comment:3 Changed 11 years ago by HoboPrimate

After installing libpopt-dev (in my Ubuntu 9.10), GConf-dbus now builds. Abiword still fails:

g++: /usr/lib/gcc/i486-linux-gnu/4.3.3/../../../../lib/crti.o: No such file or directory
g++: /usr/lib/gcc/i486-linux-gnu/4.3.3/crtbeginS.o: No such file or directory
g++: /usr/lib/gcc/i486-linux-gnu/4.3.3/crtendS.o: No such file or directory
g++: /usr/lib/gcc/i486-linux-gnu/4.3.3/../../../../lib/crtn.o: No such file or directory
make[2]: * [abiword.la] Error 1
make[2]: Leaving directory `/home/jobezone/sugar-jhbuild/source/pyabiword-0.6.2/src'
make[1]:
* [all] Error 2
make[1]: Leaving directory `/home/jobezone/sugar-jhbuild/source/pyabiword-0.6.2/src'
make: * [all-recursive] Error 1
* Error during phase build of pyabiword: ########## Error running make * [23/41]

comment:4 Changed 11 years ago by sascha_silbe

Strange, ./sugar-jhbuild depscheck should have told you to install libpopt-dev, it's listed in debian-family.xml.
Please rm -rf sugar-jhbuild/source to check the other errors are not just due to API changes that the build system of the failing package didn't notice (i.e. didn't rebuild the entire package).

comment:5 Changed 11 years ago by HoboPrimate

AH, but I forgot to run ./sugar-jhbuild depscheck, perhaps it would tell me about libpopt-dev.

I've rm -rf sugar-jhbuild, and started from scratch. It now stops at building metacity:

"In file included from core/boxes.c:30:
./include/util.h:138: error: expected ‘=’, ‘,’, ‘;’, ‘asm’ or ‘attribute’ before ‘*’ token
make[4]: * [libmetacity_private_la-boxes.lo] Error 1
make[4]: Leaving directory `/home/jobezone/sugar-jhbuild/source/metacity/src'
make[3]:
* [all-recursive] Error 1
make[3]: Leaving directory `/home/jobezone/sugar-jhbuild/source/metacity/src'
make[2]: * [all] Error 2
make[2]: Leaving directory `/home/jobezone/sugar-jhbuild/source/metacity/src'
make[1]:
* [all-recursive] Error 1
make[1]: Leaving directory `/home/jobezone/sugar-jhbuild/source/metacity'
make: * [all] Error 2
* Error during phase build of metacity: ########## Error running make * [7/41]
"

comment:6 Changed 11 years ago by sascha_silbe

As metacity is recent enough on karmic, I've change sugar-jhbuild to use the distro package instead.

Please re-check ./sugar-jhbuild depscheck (i.e. install metacity) and rerun build. It shouldn't attempt to build metacity now.

comment:7 Changed 11 years ago by HoboPrimate

yep, the build continues. Now, it stops (freezes) at the start of building etoys:

"
* Building etoys * [1/1]
make
if [ ! -d Content ] ; \

then svn checkout -r 227 http://etoys.laptop.org/svn/trunk/etoys Content ; \
else svn update -r 227 Content ; \
fi

"

comment:8 Changed 11 years ago by sascha_silbe

How long did you wait? It checks out fine for me, but takes some time to do so (about a minute for the first message to appear). Depending on your internet connection it might take longer.

comment:9 Changed 11 years ago by HoboPrimate

  • Resolution set to fixed
  • Status changed from new to closed

Sorry about that, you are right, waiting it out worked. Sugar-jhbuild now builds correctly.

comment:10 Changed 11 years ago by sascha_silbe

  • Bug Status changed from Unconfirmed to Resolved
  • Distribution/OS changed from Unspecified to Ubuntu
  • Summary changed from Failure when building sugar-jhbuild to Ubuntu 9.10 support for sugar-jhbuild
  • Type changed from defect to enhancement

Great! Please report any other obstacle you encounter.

Note: See TracTickets for help on using tickets.